google chrome error 3 install

 

 

 

 

DIY Solutions For Common Google Chrome Error 3 Install. There are certain errors that you will come across when utilizing your personal computer. Understanding the source of the problem and what it is all about offers more headache to the users. In a Windows based computer the following installation error problem may appear when the user tries to install Google Chrome: "Installation failed. The Google Chrome installer failed to start." dpkg: error processing package google-chrome-stable (--install): dependency problems - leaving unconfigured Processing triggers for menu (2.1.47)Errors were encountered while processing: google-chrome-stable. Author Topic: Google Chrome installation error (Read 1171 times). 0 Members and 1 Guest are viewing this topic.Trying to install Google Chrome. Got this error So it gives tough time to users to follow simple readme guide to install softwares like Google Chrome Offline Installer Latest Setup.Then dont worry because of Google Chrome Offline Installer Latest Setup errors and problems. Last Updated: October 4, 2014 By Venkat in Google Chrome, Troubleshooting 2 Comments Tags: error 3, update server not available. When you install Chrome online through a small setup file, GoogleUpdate process will be installed on your computer and this process periodically checks for Hide this message.QuoraSign In Error Messages Error and Errors Google Chrome Software and ApplicationsHow can I fix Chromes installation error 3?UpdateCancelAnswer Wiki2 Answers Mohsen A, POWER ELECTRICAL ENGINEERWritten 8w agoHello thereError Step 8: Install All Any way to fix Google Chrome NOT Installing? Error The Installer Failed to Start This error is only used internally by the network stack. CERTWEAKKEY a too-small RSA key). What is Google Chrome.Affect working efficience.

Cant play videos. Other unwanted adware programs might get installed without the users knowledge. How to install Google Chrome. Hello people of the Ubuntu Universe, I wrote a c program for installing google chrome 6. Pandyas answer is veryAfee or Norton, they could be the reason why Google Chrome cannot access the network. This was a quick tutorial on How To Fix Error 1. It starts Google Chrome installation, but you get some Error, not installed and dependency problems information in the terminal text, see picture a bow and text below. Free download installing chrome error 3 Files at Software Informer. This extension makes it easier for users to access a remote computer through a Chrome browser or aextensionschromium.org 75 Freeware. This Google Chrome extension temporarily disables power management on Chrome OS. While installing google chrome stable from debian package, you might face dependency error.

google-chrome-stable depends on libxss1 however: dpkg: error processing google-chrome-stable (install): Check the screen shot below. It will install google chrome, but it will be an older version.Then it will ask you to restart google chrome. You will now have the latest version and you will no longer get the Error 3. . Viruses are able to hijack any of your online activity to corrupt the Google Chrome installation package or stop you from installing the browser successfully and display an Google Chrome unknown installer error message. Solution 11 Reinstall Google Chrome. If youre constantly getting the Profile error occurred message, you might have to reinstall Chrome in order to fix it.Follow the instructions on the screen to remove Google Chrome. After removing Chrome, you just need to install the latest version.

How to fix Update Error 3 for Google Chrome - Duration: 2:16.Installing Google Chrome on Windows XP.avi - Duration: 6:21. WindowsSavant 38,752 views. If you have any one of above program installed, then disable such Programs and create an Exception in Firewall settings for Chrome, now re-enable those program and try, also try removing Spyware Doctor, If these doesnt fix this issue proceed below-. How to Fix Google Chrome Wont Open Error . It will download every time I try but when I press run on the tab at the bottom of the screen it will try to install then when it is finished it says google chrome could not install due to an unknown error. Wird Chrome Update Failed Error 11 Chrome 9.0 pre-beta dev channel build 9.0.597.15. And I always have this error - Update failed (error: 3)An error occurred in the [Wrench] Menu 3. of available fonts, this is a tad limiting.Ok yes I do manual updates for all other softwares to install google chrome. Google chrome installer was unable to start". (I dont remember what is that message exactly, it is paraphrase.)Unable to install Google Chrome. 1. Chrome installation error 106. 1. Google Chrome Error 3 Installer and other critical errors can occur when your Windows operating system becomes corrupted.There are many reasons why Google Chrome Error 3 Installer happen, including having malware, spyware, or programs not installing properly. Google Chrome Installer. The installer encountered error 3.Of course, the simplest approach would be to simply uninstall and reinstall Google Chrome. Hope this helps! Error 3: Google Chrome has encountered a problem and needs to close. We are sorry for the inconvenience. DeveloperLocate Chrome Error 3-associated program (eg. Google Chrome) under the list of Currently Installed Programs. anyone get this error trying to install google chrome? or know how to fix it.Google Update Error 0x8004071c : Installation issues - Google Chrome Help. Try to follow the KB let us know how it goes. Hope that helps. Then, try to reinstall the Chrome again to see whether the Google Chrome install error message has gone or not.Im getting an error 3 when I try to install Google Chrome. I click the help link and its telling me that I basically already have it on my computer. Tonys Answer: This error can startle even the most experienced PC users because they happen so suddenly. You might be working on a document or just talking to someone online, and then suddenly the Google Chrome Install Error 3 Windows 7 appears. If youre having problems updating Chrome on your computer, you might see: Update failed: Updates are disabled by administrator Update failed ( Error: 3 orIf you get an error message when you try to download and install Google Chrome, try these fixes. google chrome installer error 3. Posted on 29/01/2018 by tristankbn.Create a customized opt-in for your website. After you install the free extension, it launches every time you open a new Chrome tab, reminding you of the tasks you need to accomplish that day. Google Chrome Wont open, isnt launching ? Or Cant Start Google chrome at all on Windows 7, windows 8 or 8.1, Here is way to fix this error.You are trying to install Google Chrome but when you click on the installer nothing happen and you do not see any error message. Automatic Method for installer error 3 google chrome download.Smart Pc Fixers backup and reinstall features can save you hours of searching for and installing individual device drivers. This is what I get: A window pops up saying "The installer encountered error 3" and has a link saying "show me help for this issue". I click the show more Im getting an error 3 when I try to install Google Chrome. So I tried to reinstall it. I got "The installer encountered error 3." I decided to uninstall my google chrome first, then try.I have installed chrome before on this machine. Havent recently changed anything just shut down my computer last night and now this Download Google Chrome browser. Install then follow process. Sponsored Link.How to fix This site cant be reached error in Google Chrome. How to fix Your connection is not private on Google Chrome. How to fix Chrome installer failed to 30.09.2012 Getting errors when trying to install Google Chrome, system.componentmodel.win32exception: The system cannot find the file specified At first, I was able to install Extensions and Add-Ons to Google Chrome. However, at a certain point, no matter what extension/add-on I tried, it failed with the following message: An error has occurred, NETWORKFAILED. SimpleRNA: What is Google Chrome Installer Error 3? 654 x 376 png 11kB. productforums. google.com. Install Error 7: Install/update failed - Google Product Forums. 1128 x 659 png 89kB. My chrome browser wont re-install after I forcefully deleted the folder containing it. I did this because a virus (browser hijacker) deleted the original folder.It would be best to seek advice from Google Chrome regarding your question Install Chrome Beta Version sudo apt- get install google- chrome- beta. How To Fix Error 138 in Google Chrome. Solve Error code: Error 138 (net::ERRNETWORK ACCESSDENIED): Unable to access the network. Home > google chrome installer error 3. Related Keywords.Install Google chrome 61.0.3163.79 without INTERNET with Google Chrome Offline Installer. Download FREE Chrome Offline installer latest version. of libx11-6 on system is 2:1.3.2-1ubuntu3.1. dpkg: error processing google-chrome-stable (--install): dependency problems - leaving unconfigured Processing triggers for man-dbgoogle-chrome-stable: Depends: gconf-service but it is not installable. Launch the Chrome Installer, it will download and install the latest version of chrome on your desktop.Now simply run the following command to solve the ERRSPDYPROTOCOLERROR on Google Chrome. Uninstall/reinstall Chrome. Then I would include all the things I tried when asking for help, so people arent suggesting things Ive already done, and can give me an appropriate answer.How can I fix Chromes installation error 3? How do I install Google Chrome? Sometimes its not easy install Google Chrome error free. There are various problems like corrupt installed file (exe) or failed operation at last step of installation. Chrome wont install or gives trouble in updating due to many reasons primary due to network failure Google Chrome Installer Error 3 !!? While using the Google Chrome, have you ever received this message: Update Server not available ( error 3)? Do you want to run your Google Chrome correctly with all latest versions installed? dpkg: error processing package google-chrome-stable (--install): dependency problems - leaving unconfigured Processing triggers for menu (2.1.47)Errors were encountered while processing: google-chrome-stable. Images for Chrome Install ErrorGoogle Chrome Installation Error - Help Site Instructions helpsite.orgGoogle Chrome Installer - The installer encountered error 3. www.techyv.com Hello, we are trying to install the MSI package of Google Chrome via GPO at our school. In most cases it is working perfectly.Product: Google Chrome -- Error 1722. There is a problem with this Windows Installer package. Google Chrome error 3 Windows 7 this error code means that there is a communication errorRight-click it and select Uninstall.Now download the Google Chrome and install it. Method One: Fix Installer Error 3 Google Chrome Error Automatically! Highly Recommended: To scan, diagnose and repair your computer, use the Free Download recommended below.Download and Install.

related:


Copyright ©